Reaction Details
TargetATP-sensitive inward rectifier potassium channel 1
LigandBDBM155924
Substrate/Competitorn/a
Meas. Tech.Electrophysiology Assay
pH7.4±n/a
IC50 7±n/a nM
Commentsextracted
Citation Pasternak, AZhu, YShahripour, ATang, HYang, LWalsh, SPTeumelsan, NH Inhibitors of the renal outer medullary potassium channel US Patent US9018211 Publication Date 4/28/2015
 
ATP-sensitive inward rectifier potassium channel 1
Name:ATP-sensitive inward rectifier potassium channel 1
Type:Enzyme
Mol. Mass.:44976.27
Organism:Rattus norvegicus (Rat)
Description:P35560
Residue:391
BDBM155924
NameBDBM155924
Synonyms:US9018211, 5
TypeSmall organic molecule
Emp. Form.C24H24Cl2N2O6
Mol. Mass.507.363
SMILESOC(CN1CCN(CC(O)c2ccc3C(=O)OCc3c2Cl)CC1)c1ccc2C(=O)OCc2c1Cl