Reaction Details
TargetATP-sensitive inward rectifier potassium channel 1
LigandBDBM155926
Substrate/Competitorn/a
Meas. Tech.Electrophysiology Assay
pH7.4±n/a
IC50 14±n/a nM
Commentsextracted
Citation Pasternak, AZhu, YShahripour, ATang, HYang, LWalsh, SPTeumelsan, NH Inhibitors of the renal outer medullary potassium channel US Patent US9018211 Publication Date 4/28/2015
 
ATP-sensitive inward rectifier potassium channel 1
Name:ATP-sensitive inward rectifier potassium channel 1
Type:Enzyme
Mol. Mass.:44976.27
Organism:Rattus norvegicus (Rat)
Description:P35560
Residue:391
BDBM155926
NameBDBM155926
Synonyms:US9018211, 20
TypeSmall organic molecule
Emp. Form.C24H27N3O4
Mol. Mass.421.4889
SMILESCOc1cc(ccc1C#N)C(O)CN1CCN(CCc2ccc3C(=O)OCc3c2)CC1