Reaction Details
TargetThioredoxin reductase 1, cytoplasmic
LigandBDBM156236
Substrate/Competitorn/a
Meas. Tech.In vitro Assay
pH7.6±n/a
IC50 2900±n/a nM
Commentsextracted
Citation Ostaszewski, RKlossowski, SZiuzia, ISzokalska, ASwiech, MGolab, J Esters of (acyloxymethyl)acrylamide, a pharmaceutical composition containing them, and their use as inhibitors of the thioredoxin—thioredoxin reductase system US Patent US9018255 Publication Date 4/28/2015
 
Thioredoxin reductase 1, cytoplasmic
Name:Thioredoxin reductase 1, cytoplasmic
Type:Protein
Mol. Mass.:70761.78
Organism:Homo sapiens (Human)
Description:Q16881
Residue:648
BDBM156236
NameBDBM156236
Synonyms:US9018255, 3b
TypeSmall organic molecule
Emp. Form.C21H26Cl2N2O6
Mol. Mass.473.347
SMILESCCOC(=O)CNC(=O)C(CC(C)C)NC(=O)C(=C)COC(=O)c1c(Cl)cccc1Cl