Reaction Details
TargetApoptosis regulator Bcl-2
LigandBDBM156403
Substrate/Competitorn/a
Meas. Tech.Fluorescence Polarization
IC50 0.4±n/a nM
Citation Diebold, RBGero, TGrover, PHuang, SIoannidis, SOgoe, CASaeh, JC Chemical compounds US Patent US9018381 Publication Date 4/28/2015
 
Apoptosis regulator Bcl-2
Name:Apoptosis regulator Bcl-2
Type:Homodimer or heterodimer
Mol. Mass.:26269.11
Organism:Homo sapiens (Human)
Description:P10415
Residue:239
BDBM156403
NameBDBM156403
Synonyms:US9018381, 26 | US9248140, 26
TypeSmall organic molecule
Emp. Form.C51H59ClF3N5O7S3
Mol. Mass.1042.687
SMILESCCN(CC)CC1CN(CC[C@H](CSc2ccccc2)Nc2ccc(cc2S(=O)(=O)C(F)(F)F)S(=O)(=O)NC(=O)c2ccc(cc2)N2CCC(CC2)[C@@H](O)c2ccccc2-c2ccc(Cl)cc2)CCO1