Reaction Details
TargetGamma-secretase-activating protein
LigandBDBM157135
Substrate/Competitorn/a
Meas. Tech.HTRF Biochemical Assay
IC50 1.0±0.0 nM
Citation Shelton, CCTian, YLi, Y γ-Secretase substrates and methods of use US Patent US9023767 Publication Date 5/5/2015
 
Gamma-secretase-activating protein
Name:Gamma-secretase-activating protein
Type:Protein
Mol. Mass.:97808.44
Organism:Homo sapiens (Human)
Description:A4D1B5
Residue:854
BDBM157135
NameBDBM157135
Synonyms:US9023767, GSI-34
TypeSmall organic molecule
Emp. Form.C25H24ClFN2O4S2
Mol. Mass.535.05
SMILESFc1ccc(OCC(=O)Nc2ccc3CC4CCC(Cc3c2)C4NS(=O)(=O)c2ccc(Cl)s2)cc1