Reaction Details
TargetMitogen-activated protein kinase 1
LigandBDBM157173
Substrate/Competitorn/a
Meas. Tech.IMAP-FP Assay
IC50 0.296±n/a nM
Citation Lim, JKelley, EHMethot, JLZhou, HPetrocchi, AMansoor, UFFischer, CO'Boyle, BGuerin, DJBienstock, CEBoyce, CWDaniels, MHFalcone, DFerguson, RDFevrier, SHuang, XLipford, KASloman, DLWilson, KZhou, WWitter, DMaletic, MMSiliphaivanh, P Compounds that are ERK inhibitors US Patent US9023865 Publication Date 5/5/2015
 
Mitogen-activated protein kinase 1
Name:Mitogen-activated protein kinase 1
Type:Protein
Mol. Mass.:41278.65
Organism:Mus musculus (Mouse)
Description:P63085
Residue:358
BDBM157173
NameBDBM157173
Synonyms:US9023865, 19
TypeSmall organic molecule
Emp. Form.C21H19ClN6O
Mol. Mass.406.868
SMILESC[C@@H](NC(=O)Nc1cc2[nH]nc(-c3ccnc(C)c3)c2cn1)c1ccc(Cl)cc1