Reaction Details
TargetMitogen-activated protein kinase 1
LigandBDBM157694
Substrate/Competitorn/a
Meas. Tech.IMAP-FP Assay
IC50 0.3036±n/a nM
Citation Lim, JKelley, EHMethot, JLZhou, HPetrocchi, AMansoor, UFFischer, CO'Boyle, BGuerin, DJBienstock, CEBoyce, CWDaniels, MHFalcone, DFerguson, RDFevrier, SHuang, XLipford, KASloman, DLWilson, KZhou, WWitter, DMaletic, MMSiliphaivanh, P Compounds that are ERK inhibitors US Patent US9023865 Publication Date 5/5/2015
 
Mitogen-activated protein kinase 1
Name:Mitogen-activated protein kinase 1
Type:Ser/Thr Protein Kinase
Mol. Mass.:41392.76
Organism:Homo sapiens (Human)
Description:P28482
Residue:360
BDBM157694
NameBDBM157694
Synonyms:US9023865, 535
TypeSmall organic molecule
Emp. Form.C22H19F2N5O
Mol. Mass.407.416
SMILESC[C@@H](NC(=O)Nc1ccc2c(n[nH]c2c1F)-c1ccnc(C)c1)c1ccc(F)cc1