Reaction Details
TargetBeta-secretase 2
LigandBDBM47353
Substrate/Competitorn/a
Meas. Tech.HTRF FRET Assay
pH5±n/a
Temperature303.15±n/a K
Ki 0.47±n/a nM
Commentsextracted
Citation Scott, JDStamford, AWGilbert, EJCumming, JN Iminothiadiazine dioxide compounds as brace inhibitors, compositions, and their use US Patent US9029362 Publication Date 5/12/2015
 
Beta-secretase 2
Name:Beta-secretase 2
Type:Protein
Mol. Mass.:56171.20
Organism:Homo sapiens (Human)
Description:Q9Y5Z0
Residue:518
BDBM47353
NameBDBM47353
Synonyms:BDBM143220 US9687494, 25
Typen/a
Emp. Form.C17H17F2N5O3S
Mol. Mass.409.41
SMILESCN1C(=N)N[C@@](C)(CS1(=O)=O)c1cc(NC(=O)c2ccc(F)cn2)ccc1F