Reaction Details
TargetAdenosine receptor A2a
LigandBDBM158411
Substrate/Competitorn/a
Meas. Tech.FRET-Based Binding Assay
Ki 264±n/a nM
Citation Schann, SMayer, S Adenosine receptor ligands and uses thereof US Patent US9029393 Publication Date 5/12/2015
 
Adenosine receptor A2a
Name:Adenosine receptor A2a
Type:G Protein-Coupled Receptor (GPCR)
Mol. Mass.:44716.46
Organism:Homo sapiens (Human)
Description:P29274
Residue:412
BDBM158411
NameBDBM158411
Synonyms:US9029393, 23
TypeSmall organic molecule
Emp. Form.C22H24N4O2
Mol. Mass.376.4516
SMILESCCN(C1CCCCC1)C(=O)c1ccc(nc1)C(=O)c1cnc2ccccn12