Reaction Details
TargetAdenosine receptor A2a
LigandBDBM158425
Substrate/Competitorn/a
Meas. Tech.FRET-Based Binding Assay
Ki 348±n/a nM
Citation Schann, SMayer, S Adenosine receptor ligands and uses thereof US Patent US9029393 Publication Date 5/12/2015
 
Adenosine receptor A2a
Name:Adenosine receptor A2a
Type:G Protein-Coupled Receptor (GPCR)
Mol. Mass.:44716.46
Organism:Homo sapiens (Human)
Description:P29274
Residue:412
BDBM158425
NameBDBM158425
Synonyms:US9029393, 134
TypeSmall organic molecule
Emp. Form.C22H21FN4O
Mol. Mass.376.4267
SMILESFc1ccc2ncc(-c3c[nH]c4cc(ccc34)C(=O)N3CCCCCC3)n2c1