Reaction Details
TargetRAF proto-oncogene serine/threonine-protein kinase
LigandBDBM16673
Substrate/Competitorn/a
Meas. Tech.ADP-Glo Kinase Assay
pH7.5±n/a
IC50 45±n/a nM
Commentsextracted
Citation Hammock, BDHwang, SHWecksler, ATMorisseau, C Sorafenib derivatives as sEH inhibitors US Patent US9029401 Publication Date 5/12/2015
 
RAF proto-oncogene serine/threonine-protein kinase
Name:RAF proto-oncogene serine/threonine-protein kinase
Type:Serine/threonine-protein kinase
Mol. Mass.:73082.52
Organism:Homo sapiens (Human)
Description:P04049
Residue:648
BDBM16673
NameBDBM16673
Synonyms:4-[4-({[4-chloro-3-(trifluoromethyl)phenyl]carbamoyl}amino)phenoxy]-N-methylpyridine-2-carboxamide BAY 43-9006 BAY439006 Hit compound, 8 Sorafenib US10183928, Sorafenib US10227329, Compound Sorafenib US10774070, Compound Sorafenib US11279688, Compound Sorafenib US9029401, Sorafenib US9902709, Comparative example 1 cid_216239
TypeSmall organic molecule
Emp. Form.C21H16ClF3N4O3
Mol. Mass.464.825
SMILESCNC(=O)c1cc(Oc2ccc(NC(=O)Nc3ccc(Cl)c(c3)C(F)(F)F)cc2)ccn1