Reaction Details
TargetVascular endothelial growth factor receptor 2
LigandBDBM287573
Substrate/Competitorn/a
Meas. Tech.VEGFR2 Kinase Assay
pH7.4±n/a
IC50 3.00±n/a nM
Commentsextracted
Citation Boral, SWang, SMalone, TCWurster, JShen, JRobinson, M Substituted nicotinamide derivatives as kinase inhibitors US Patent US9567324 Publication Date 2/14/2017
 
Vascular endothelial growth factor receptor 2
Name:Vascular endothelial growth factor receptor 2
Type:Receptor Tyrosine Kinase
Mol. Mass.:151510.97
Organism:Homo sapiens (Human)
Description:P35968
Residue:1356
BDBM287573
NameBDBM287573
Synonyms:US9567324, 13
TypeSmall organic molecule
Emp. Form.C29H31N5O6S
Mol. Mass.577.651
SMILESCc1ccoc1C(=O)Nc1cccc(c1)C#Cc1cc(cnc1N)C(=O)N=S1(=O)CCN(CC1)C(=O)OC(C)(C)C