Reaction Details
TargetEstrogen receptor beta
LigandBDBM158504
Substrate/Competitorn/a
Meas. Tech.Binding Assay
pH7.5±n/a
Temperature298.15±n/a K
Ki 0.025±n/a nM
Commentsextracted
Citation Coelingh Bennink, HJBunschoten, EJ Pharmaceutical composition comprising estetrol derivatives for use in cancer therapy US Patent US9034854 Publication Date 5/19/2015
 
Estrogen receptor beta
Name:Estrogen receptor beta
Type:Protein
Mol. Mass.:59238.43
Organism:Homo sapiens (Human)
Description:Q92731
Residue:530
BDBM158504
NameBDBM158504
Synonyms:US9034854, EE US9561238, EE
TypeSmall organic molecule
Emp. Form.C20H24O2
Mol. Mass.296.4034
SMILESCC12CC[C@H]3[C@@H](CCc4cc(O)ccc34)[C@@H]1CC[C@@]2(O)C#C