Reaction Details
TargetMethyl-CpG-binding domain protein 2
LigandBDBM158507
Substrate/Competitorn/a
Meas. Tech.Binding Assay
IC50 6140±n/a nM
Citation Nelson, WGYegnasubramanian, SLin, XSpeed, TJReichert, Z Agents for reversing epigenetic silencing of genes US Patent US9034574 Publication Date 5/19/2015
 
Methyl-CpG-binding domain protein 2
Name:Methyl-CpG-binding domain protein 2
Type:Enzyme Catalytic Domain
Mol. Mass.:43278.74
Organism:Homo sapiens (Human)
Description:gi_21595776
Residue:411
BDBM158507
NameBDBM158507
Synonyms:US9034574, Add | US9034574, III
TypeSmall organic molecule
Emp. Form.C16H12N4O2
Mol. Mass.292.2921
SMILESCn1c2ccccc2n2cc(nc12)-c1ccc(cc1)[N+]([O-])=O