Reaction Details
TargetMethyl-CpG-binding domain protein 2
LigandBDBM158511
Substrate/Competitorn/a
Meas. Tech.Binding Assay
IC50 210±n/a nM
Citation Nelson, WGYegnasubramanian, SLin, XSpeed, TJReichert, Z Agents for reversing epigenetic silencing of genes US Patent US9034574 Publication Date 5/19/2015
 
Methyl-CpG-binding domain protein 2
Name:Methyl-CpG-binding domain protein 2
Type:Enzyme Catalytic Domain
Mol. Mass.:43278.74
Organism:Homo sapiens (Human)
Description:gi_21595776
Residue:411
BDBM158511
NameBDBM158511
Synonyms:US9034574, XXI
TypeSmall organic molecule
Emp. Form.C14H11ClN2S
Mol. Mass.274.769
SMILESClc1ccc(cc1)C1NN=C(S1)c1ccccc1