Reaction Details
TargetMitogen-activated protein kinase kinase kinase 14
LigandBDBM158531
Substrate/Competitorn/a
Meas. Tech.Inhibition Assay
pH7.2±n/a
Ki 0.3±n/a nM
Commentsextracted
Citation Staben, SCastanedo, GMontalbetti, CAFeng, J Tricyclic compounds and methods of use therefor US Patent US9034866 Publication Date 5/19/2015
 
Mitogen-activated protein kinase kinase kinase 14
Name:Mitogen-activated protein kinase kinase kinase 14
Type:Protein
Mol. Mass.:104059.50
Organism:Homo sapiens (Human)
Description:Q99558
Residue:947
BDBM158531
NameBDBM158531
Synonyms:US9034866, 6
TypeSmall organic molecule
Emp. Form.C20H17FN4O4
Mol. Mass.396.3718
SMILESCc1cc(no1)[C@](C)(O)C#Cc1cc2-c3nc(cn3CCOc2cc1F)C(N)=O