Reaction Details
TargetMitogen-activated protein kinase kinase kinase 14
LigandBDBM158621
Substrate/Competitorn/a
Meas. Tech.Inhibition Assay
pH7.2±n/a
Ki 0.3±n/a nM
Commentsextracted
Citation Staben, SCastanedo, GMontalbetti, CAFeng, J Tricyclic compounds and methods of use therefor US Patent US9034866 Publication Date 5/19/2015
 
Mitogen-activated protein kinase kinase kinase 14
Name:Mitogen-activated protein kinase kinase kinase 14
Type:Protein
Mol. Mass.:104059.50
Organism:Homo sapiens (Human)
Description:Q99558
Residue:947
BDBM158621
NameBDBM158621
Synonyms:US9034866, 96
TypeSmall organic molecule
Emp. Form.C22H21N5O5
Mol. Mass.435.4326
SMILESCNC(=O)c1c(nc2-c3cc(ccc3OCCn12)C#C[C@@](C)(O)c1cc(C)on1)C(N)=O