Reaction Details
TargetMitogen-activated protein kinase kinase kinase 14
LigandBDBM158697
Substrate/Competitorn/a
Meas. Tech.Inhibition Assay
pH7.2±n/a
Ki 0.4±n/a nM
Commentsextracted
Citation Staben, SCastanedo, GMontalbetti, CAFeng, J Tricyclic compounds and methods of use therefor US Patent US9034866 Publication Date 5/19/2015
 
Mitogen-activated protein kinase kinase kinase 14
Name:Mitogen-activated protein kinase kinase kinase 14
Type:Protein
Mol. Mass.:104059.50
Organism:Homo sapiens (Human)
Description:Q99558
Residue:947
BDBM158697
NameBDBM158697
Synonyms:US9034866, 172
TypeSmall organic molecule
Emp. Form.C24H20FN7O3
Mol. Mass.473.4591
SMILESCC(C)(O)C#Cc1cc2-c3nc(C(N)=O)c(-c4nc(n[nH]4)-c4cccnc4)n3CCOc2cc1F