Reaction Details
TargetMitogen-activated protein kinase kinase kinase 14
LigandBDBM158743
Substrate/Competitorn/a
Meas. Tech.Inhibition Assay
pH7.2±n/a
Ki 0.31±n/a nM
Commentsextracted
Citation Staben, SCastanedo, GMontalbetti, CAFeng, J Tricyclic compounds and methods of use therefor US Patent US9034866 Publication Date 5/19/2015
 
Mitogen-activated protein kinase kinase kinase 14
Name:Mitogen-activated protein kinase kinase kinase 14
Type:Protein
Mol. Mass.:104059.50
Organism:Homo sapiens (Human)
Description:Q99558
Residue:947
BDBM158743
NameBDBM158743
Synonyms:US9034866, 218
TypeSmall organic molecule
Emp. Form.C25H23FN4O3
Mol. Mass.446.4735
SMILESCc1cc(no1)[C@](C)(O)C#Cc1cc2-c3nc(C(N)=O)c(C4CC4)n3C3CC(C3)c2cc1F