Reaction Details
TargetMitogen-activated protein kinase kinase kinase 14
LigandBDBM158773
Substrate/Competitorn/a
Meas. Tech.Inhibition Assay
pH7.2±n/a
Ki 0.5±n/a nM
Commentsextracted
Citation Staben, SCastanedo, GMontalbetti, CAFeng, J Tricyclic compounds and methods of use therefor US Patent US9034866 Publication Date 5/19/2015
 
Mitogen-activated protein kinase kinase kinase 14
Name:Mitogen-activated protein kinase kinase kinase 14
Type:Protein
Mol. Mass.:104059.50
Organism:Homo sapiens (Human)
Description:Q99558
Residue:947
BDBM158773
NameBDBM158773
Synonyms:US9034866, 248
TypeSmall organic molecule
Emp. Form.C22H24FN3O3
Mol. Mass.397.4427
SMILESCC(C)(O)C#Cc1cc2-c3nc(C(N)=O)c(n3C3CC(C3)c2cc1F)C(C)(C)O