Reaction Details
TargetMitogen-activated protein kinase kinase kinase 14
LigandBDBM158775
Substrate/Competitorn/a
Meas. Tech.Inhibition Assay
pH7.2±n/a
Ki 0.12±n/a nM
Commentsextracted
Citation Staben, SCastanedo, GMontalbetti, CAFeng, J Tricyclic compounds and methods of use therefor US Patent US9034866 Publication Date 5/19/2015
 
Mitogen-activated protein kinase kinase kinase 14
Name:Mitogen-activated protein kinase kinase kinase 14
Type:Protein
Mol. Mass.:104059.50
Organism:Homo sapiens (Human)
Description:Q99558
Residue:947
BDBM158775
NameBDBM158775
Synonyms:US9034866, 250
TypeSmall organic molecule
Emp. Form.C21H22N4O3
Mol. Mass.378.4244
SMILESCNC(=O)c1c(nc2-c3cc(ccc3C3CC(C3)n12)C#CC(C)(C)O)C(N)=O