Reaction Details
TargetMitogen-activated protein kinase kinase kinase 14
LigandBDBM158936
Substrate/Competitorn/a
Meas. Tech.Inhibition Assay
pH7.2±n/a
Ki 0.3±n/a nM
Commentsextracted
Citation Staben, SCastanedo, GMontalbetti, CAFeng, J Tricyclic compounds and methods of use therefor US Patent US9034866 Publication Date 5/19/2015
 
Mitogen-activated protein kinase kinase kinase 14
Name:Mitogen-activated protein kinase kinase kinase 14
Type:Protein
Mol. Mass.:104059.50
Organism:Homo sapiens (Human)
Description:Q99558
Residue:947
BDBM158936
NameBDBM158936
Synonyms:US9034866, 411
TypeSmall organic molecule
Emp. Form.C20H18F3N3O2
Mol. Mass.389.371
SMILESCC(C)(O)C#Cc1cc2-c3nc(C(N)=O)n(C(F)F)c3C3CC(C3)c2cc1F