Reaction Details
TargetMitogen-activated protein kinase kinase kinase 14
LigandBDBM158944
Substrate/Competitorn/a
Meas. Tech.Inhibition Assay
pH7.2±n/a
Ki 0.5±n/a nM
Commentsextracted
Citation Staben, SCastanedo, GMontalbetti, CAFeng, J Tricyclic compounds and methods of use therefor US Patent US9034866 Publication Date 5/19/2015
 
Mitogen-activated protein kinase kinase kinase 14
Name:Mitogen-activated protein kinase kinase kinase 14
Type:Protein
Mol. Mass.:104059.50
Organism:Homo sapiens (Human)
Description:Q99558
Residue:947
BDBM158944
NameBDBM158944
Synonyms:US9034866, 419
TypeSmall organic molecule
Emp. Form.C21H21N5O5
Mol. Mass.423.4219
SMILESCNC(=O)c1c(nc2-c3cc(ccc3OCCn12)C#C[C@]1(O)CCN(C)C1=O)C(N)=O