Reaction Details
TargetHistamine H3 receptor
LigandBDBM159248
Substrate/Competitorn/a
Meas. Tech.LANCE Ultra cAMP Assay
Ki 1.1±n/a nM
Citation Auberson, YBock, MGBraga, DCurzi, MDodd, SKGiaffreda, SLJiang, HKarpinski, PTroxler, TJWang, TWang, XZhang, X Carbamate/urea derivatives US Patent US9034874 Publication Date 5/19/2015
 
Histamine H3 receptor
Name:Histamine H3 receptor
Type:G Protein-Coupled Receptor (GPCR)
Mol. Mass.:48691.47
Organism:Homo sapiens (Human)
Description:Binding assays were using CHO cells stably expressing hH3R receptors.
Residue:445
BDBM159248
NameBDBM159248
Synonyms:US9034874, 1.5
TypeSmall organic molecule
Emp. Form.C19H29N5O3
Mol. Mass.375.4653
SMILESCn1nc(ccc1=O)N1CCC(CC1)OC(=O)N1CCN(CC1)C1CCC1