Reaction Details
TargetHistamine H3 receptor
LigandBDBM159250
Substrate/Competitorn/a
Meas. Tech.Radioligand Binding Assay
pH7.5±n/a
Ki 20±n/a nM
Commentsextracted
Citation Auberson, YBock, MGBraga, DCurzi, MDodd, SKGiaffreda, SLJiang, HKarpinski, PTroxler, TJWang, TWang, XZhang, X Carbamate/urea derivatives US Patent US9034874 Publication Date 5/19/2015
 
Histamine H3 receptor
Name:Histamine H3 receptor
Type:G Protein-Coupled Receptor (GPCR)
Mol. Mass.:48691.47
Organism:Homo sapiens (Human)
Description:Binding assays were using CHO cells stably expressing hH3R receptors.
Residue:445
BDBM159250
NameBDBM159250
Synonyms:US9034874, 2.1
TypeSmall organic molecule
Emp. Form.C19H30N4O3
Mol. Mass.362.4665
SMILESCC(C)N1CCN(CC1)C(=O)OC1CCN(CC1)c1ccn(C)c(=O)c1