Reaction Details
TargetHistamine H3 receptor
LigandBDBM159253
Substrate/Competitorn/a
Meas. Tech.Radioligand Binding Assay
pH7.5±n/a
Ki 1.2±n/a nM
Commentsextracted
Citation Auberson, YBock, MGBraga, DCurzi, MDodd, SKGiaffreda, SLJiang, HKarpinski, PTroxler, TJWang, TWang, XZhang, X Carbamate/urea derivatives US Patent US9034874 Publication Date 5/19/2015
 
Histamine H3 receptor
Name:Histamine H3 receptor
Type:G Protein-Coupled Receptor (GPCR)
Mol. Mass.:48691.47
Organism:Homo sapiens (Human)
Description:Binding assays were using CHO cells stably expressing hH3R receptors.
Residue:445
BDBM159253
NameBDBM159253
Synonyms:US9034874, 3.1
TypeSmall organic molecule
Emp. Form.C18H28N4O3
Mol. Mass.348.4399
SMILESCC(C)N1CCN(CC1)C(=O)OC1CCN(CC1)c1ccc(=O)[nH]c1