Reaction Details
TargetSodium/glucose cotransporter 2
LigandBDBM159521
Substrate/Competitorn/a
Meas. Tech.Inhibition Assay
pH7.4±n/a
Temperature310.15±n/a K
IC50 0.651±n/a nM
Commentsextracted
Citation Choi, SSong, KSLee, SHKim, MJSeo, HJPark, EKong, YPark, SOKang, HJung, MELee, KKim, HJLee, JSLee, MWKim, MHong, DHKang, M Diphenylmethane derivatives as SGLT2 inhibitors US Patent US9034921 Publication Date 5/19/2015
 
Sodium/glucose cotransporter 2
Name:Sodium/glucose cotransporter 2
Type:Protein
Mol. Mass.:72902.00
Organism:Homo sapiens (Human)
Description:P31639
Residue:672
BDBM159521
NameBDBM159521
Synonyms:US9034921, E163 | US9340521, E027
TypeSmall organic molecule
Emp. Form.C24H27ClO7
Mol. Mass.462.92
SMILESOC[C@H]1O[C@H]([C@H](O)[C@@H](O)[C@@H]1O)c1cc(Cc2ccc(cc2)C2CC2)c(Cl)c2OCCOc12