Reaction Details
Target2-acylglycerol O-acyltransferase 2
LigandBDBM159624
Substrate/Competitorn/a
Meas. Tech.Inhibition Assay
IC50 26±n/a nM
Citation Busujima, TOi, TTanaka, HShirasaki, YIwakiri, KSato, NTokita, S Nitrogen-containing condensed heterocyclic compound US Patent US9035059 Publication Date 5/19/2015
 
2-acylglycerol O-acyltransferase 2
Name:2-acylglycerol O-acyltransferase 2
Type:Enzyme
Mol. Mass.:38210.80
Organism:Homo sapiens (Human)
Description:Q3SYC2
Residue:334
BDBM159624
NameBDBM159624
Synonyms:US9035059, 6-33
TypeSmall organic molecule
Emp. Form.C33H44FN3O3S
Mol. Mass.581.784
SMILESCCCCCCCCOc1ccc(NS(=O)(=O)c2ccc3CN(Cc4ccc(nc4)C(C)(C)C)CCc3c2)c(F)c1