Reaction Details
Target2-acylglycerol O-acyltransferase 2
LigandBDBM159625
Substrate/Competitorn/a
Meas. Tech.Inhibition Assay
IC50 36±n/a nM
Citation Busujima, TOi, TTanaka, HShirasaki, YIwakiri, KSato, NTokita, S Nitrogen-containing condensed heterocyclic compound US Patent US9035059 Publication Date 5/19/2015
 
2-acylglycerol O-acyltransferase 2
Name:2-acylglycerol O-acyltransferase 2
Type:Enzyme
Mol. Mass.:38210.80
Organism:Homo sapiens (Human)
Description:Q3SYC2
Residue:334
BDBM159625
NameBDBM159625
Synonyms:US9035059, 6-34
TypeSmall organic molecule
Emp. Form.C36H42FN3O3S
Mol. Mass.615.8
SMILESCC(C)(C)c1ccc(CN2CCc3cc(ccc3C2)S(=O)(=O)Nc2ccc(OCCCCCc3ccccc3)cc2F)cn1