Reaction Details
Target2-acylglycerol O-acyltransferase 2
LigandBDBM159630
Substrate/Competitorn/a
Meas. Tech.Inhibition Assay
IC50 49±n/a nM
Citation Busujima, TOi, TTanaka, HShirasaki, YIwakiri, KSato, NTokita, S Nitrogen-containing condensed heterocyclic compound US Patent US9035059 Publication Date 5/19/2015
 
2-acylglycerol O-acyltransferase 2
Name:2-acylglycerol O-acyltransferase 2
Type:Enzyme
Mol. Mass.:38210.80
Organism:Homo sapiens (Human)
Description:Q3SYC2
Residue:334
BDBM159630
NameBDBM159630
Synonyms:US9035059, 6-48
TypeSmall organic molecule
Emp. Form.C31H40FN3O2S2
Mol. Mass.569.797
SMILESCC(C)(C)c1ncc(CN2CCc3cc(ccc3C2)S(=O)(=O)Nc2ccc(CCCC3CCCC3)cc2F)s1