Reaction Details
Target2-acylglycerol O-acyltransferase 2
LigandBDBM159633
Substrate/Competitorn/a
Meas. Tech.Inhibition Assay
IC50 40±n/a nM
Citation Busujima, TOi, TTanaka, HShirasaki, YIwakiri, KSato, NTokita, S Nitrogen-containing condensed heterocyclic compound US Patent US9035059 Publication Date 5/19/2015
 
2-acylglycerol O-acyltransferase 2
Name:2-acylglycerol O-acyltransferase 2
Type:Enzyme
Mol. Mass.:38210.80
Organism:Homo sapiens (Human)
Description:Q3SYC2
Residue:334
BDBM159633
NameBDBM159633
Synonyms:US9035059, 6-64
TypeSmall organic molecule
Emp. Form.C33H43FN4O2S
Mol. Mass.578.784
SMILESCC(C)(C)c1cnc(CCN2CCc3cc(ccc3C2)S(=O)(=O)Nc2ccc(CCCC3CCCC3)cc2F)nc1