Reaction Details
Target2-acylglycerol O-acyltransferase 2
LigandBDBM159687
Substrate/Competitorn/a
Meas. Tech.Inhibition Assay
IC50 44±n/a nM
Citation Busujima, TOi, TTanaka, HShirasaki, YIwakiri, KSato, NTokita, S Nitrogen-containing condensed heterocyclic compound US Patent US9035059 Publication Date 5/19/2015
 
2-acylglycerol O-acyltransferase 2
Name:2-acylglycerol O-acyltransferase 2
Type:Enzyme
Mol. Mass.:38210.80
Organism:Homo sapiens (Human)
Description:Q3SYC2
Residue:334
BDBM159687
NameBDBM159687
Synonyms:US9035059, 10-15/10-16
TypeSmall organic molecule
Emp. Form.C35H45FN2O4S
Mol. Mass.608.806
SMILESCC(Cc1ccc(cc1)C(C)(C)C)N1CCc2cc(ccc2C1)S(=O)(=O)Nc1ccc(OCCC2CCOCC2)cc1F