Reaction Details
Target2-acylglycerol O-acyltransferase 2
LigandBDBM159707
Substrate/Competitorn/a
Meas. Tech.Inhibition Assay
IC50 29±n/a nM
Citation Busujima, TOi, TTanaka, HShirasaki, YIwakiri, KSato, NTokita, S Nitrogen-containing condensed heterocyclic compound US Patent US9035059 Publication Date 5/19/2015
 
2-acylglycerol O-acyltransferase 2
Name:2-acylglycerol O-acyltransferase 2
Type:Enzyme
Mol. Mass.:38210.80
Organism:Homo sapiens (Human)
Description:Q3SYC2
Residue:334
BDBM159707
NameBDBM159707
Synonyms:US9035059, 18-11
TypeSmall organic molecule
Emp. Form.C33H40FN3O4S
Mol. Mass.593.752
SMILESCC(C)(C)c1ccc(NC(=O)N2Cc3ccc(cc3C2)S(=O)(=O)Nc2ccc(OCCC3CCCCC3)cc2F)cc1