Reaction Details
Target2-acylglycerol O-acyltransferase 2
LigandBDBM159723
Substrate/Competitorn/a
Meas. Tech.Inhibition Assay
IC50 30±n/a nM
Citation Busujima, TOi, TTanaka, HShirasaki, YIwakiri, KSato, NTokita, S Nitrogen-containing condensed heterocyclic compound US Patent US9035059 Publication Date 5/19/2015
 
2-acylglycerol O-acyltransferase 2
Name:2-acylglycerol O-acyltransferase 2
Type:Enzyme
Mol. Mass.:38210.80
Organism:Homo sapiens (Human)
Description:Q3SYC2
Residue:334
BDBM159723
NameBDBM159723
Synonyms:US9035059, 19-2
TypeSmall organic molecule
Emp. Form.C35H38FN3O4S
Mol. Mass.615.757
SMILESCC(C)(C)c1ccc(NC(=O)N2Cc3ccc(cc3C2)S(=O)(=O)Nc2ccc(OCCCCc3ccccc3)cc2F)cc1