Reaction Details
Target2-acylglycerol O-acyltransferase 2
LigandBDBM159667
Substrate/Competitorn/a
Meas. Tech.Inhibition Assay
Temperature298.15±n/a K
IC50 35±n/a nM
Commentsextracted
Citation Busujima, TOi, TTanaka, HShirasaki, YIwakiri, KSato, NTokita, S Nitrogen-containing condensed heterocyclic compound US Patent US9035059 Publication Date 5/19/2015
 
2-acylglycerol O-acyltransferase 2
Name:2-acylglycerol O-acyltransferase 2
Type:Enzyme
Mol. Mass.:38210.80
Organism:Homo sapiens (Human)
Description:Q3SYC2
Residue:334
BDBM159667
NameBDBM159667
Synonyms:US9035059, 8-6
TypeSmall organic molecule
Emp. Form.C36H41FN2O5S2
Mol. Mass.664.85
SMILESCC(C)(C)c1ccc(CCN2CCc3cc(ccc3C2)S(=O)(=O)Nc2ccc(OCCCS(=O)(=O)c3ccccc3)cc2F)cc1