Reaction Details
Target2-acylglycerol O-acyltransferase 2
LigandBDBM159679
Substrate/Competitorn/a
Meas. Tech.Inhibition Assay
Temperature298.15±n/a K
IC50 46±n/a nM
Commentsextracted
Citation Busujima, TOi, TTanaka, HShirasaki, YIwakiri, KSato, NTokita, S Nitrogen-containing condensed heterocyclic compound US Patent US9035059 Publication Date 5/19/2015
 
2-acylglycerol O-acyltransferase 2
Name:2-acylglycerol O-acyltransferase 2
Type:Enzyme
Mol. Mass.:38210.80
Organism:Homo sapiens (Human)
Description:Q3SYC2
Residue:334
BDBM159679
NameBDBM159679
Synonyms:US9035059, 9-23
TypeSmall organic molecule
Emp. Form.C33H43FN4O2S
Mol. Mass.578.784
SMILESCC(C)(C)c1cnc(CCN2CCc3cc(ccc3C2)S(=O)(=O)Nc2ccc(CCCC3CCCC3)cc2F)cn1