Reaction Details
Target2-acylglycerol O-acyltransferase 2
LigandBDBM159740
Substrate/Competitorn/a
Meas. Tech.Inhibition Assay
Temperature298.15±n/a K
IC50 10±n/a nM
Commentsextracted
Citation Busujima, TOi, TTanaka, HShirasaki, YIwakiri, KSato, NTokita, S Nitrogen-containing condensed heterocyclic compound US Patent US9035059 Publication Date 5/19/2015
 
2-acylglycerol O-acyltransferase 2
Name:2-acylglycerol O-acyltransferase 2
Type:Enzyme
Mol. Mass.:38210.80
Organism:Homo sapiens (Human)
Description:Q3SYC2
Residue:334
BDBM159740
NameBDBM159740
Synonyms:US9035059, 24-11 | US9035059, 24-5/24-6
TypeSmall organic molecule
Emp. Form.C26H35FN2O2S
Mol. Mass.458.632
SMILESCC(C)N1CCc2cc(ccc2C1)S(=O)(=O)Nc1ccc(CCCC2CCCC2)cc1F