Reaction Details
TargetTyrosine-protein kinase JAK1
LigandBDBM159755
Substrate/Competitorn/a
Meas. Tech.Enzyme Assay
pH7.4±n/a
Temperature298.15±n/a K
IC50 16±n/a nM
Commentsextracted
Citation Brown, MFFenwick, AEFlanagan, MEGonzales, AJohnson, TAKaila, NMitton-Fry, MJStrohbach, JWTenBrink, RETrzupek, JDUnwalla, RJVazquez, MLParikh, MD Pyrrolo[2,3-D]pyrimidine derivatives US Patent US9035074 Publication Date 5/19/2015
 
Tyrosine-protein kinase JAK1
Name:Tyrosine-protein kinase JAK1
Type:Protein
Mol. Mass.:133293.73
Organism:Homo sapiens (Human)
Description:P23458
Residue:1154
BDBM159755
NameBDBM159755
Synonyms:US10966980, Example 7B | US9035074, 7B
TypeSmall organic molecule
Emp. Form.C18H24N6O2S
Mol. Mass.388.487
SMILESCN([C@@H]1C[C@@H](C1)NS(=O)(=O)[C@H]1C[C@](C)(CC#N)C1)c1ncnc2[nH]ccc12