Reaction Details
TargetTyrosine-protein kinase JAK1
LigandBDBM159761
Substrate/Competitorn/a
Meas. Tech.Enzyme Assay
pH7.4±n/a
Temperature298.15±n/a K
IC50 5±n/a nM
Commentsextracted
Citation Brown, MFFenwick, AEFlanagan, MEGonzales, AJohnson, TAKaila, NMitton-Fry, MJStrohbach, JWTenBrink, RETrzupek, JDUnwalla, RJVazquez, MLParikh, MD Pyrrolo[2,3-D]pyrimidine derivatives US Patent US9035074 Publication Date 5/19/2015
 
Tyrosine-protein kinase JAK1
Name:Tyrosine-protein kinase JAK1
Type:Protein
Mol. Mass.:133293.73
Organism:Homo sapiens (Human)
Description:P23458
Residue:1154
BDBM159761
NameBDBM159761
Synonyms:US10966980, Example 13 | US9035074, 13
TypeSmall organic molecule
Emp. Form.C15H19F2N5O2S
Mol. Mass.371.405
SMILESCN([C@@H]1C[C@@H](C1)NS(=O)(=O)C1CC(F)(F)C1)c1ncnc2[nH]ccc12