Reaction Details
TargetTyrosine-protein kinase JAK1
LigandBDBM159763
Substrate/Competitorn/a
Meas. Tech.Enzyme Assay
pH7.4±n/a
Temperature298.15±n/a K
IC50 6±n/a nM
Commentsextracted
Citation Brown, MFFenwick, AEFlanagan, MEGonzales, AJohnson, TAKaila, NMitton-Fry, MJStrohbach, JWTenBrink, RETrzupek, JDUnwalla, RJVazquez, MLParikh, MD Pyrrolo[2,3-D]pyrimidine derivatives US Patent US9035074 Publication Date 5/19/2015
 
Tyrosine-protein kinase JAK1
Name:Tyrosine-protein kinase JAK1
Type:Protein
Mol. Mass.:133293.73
Organism:Homo sapiens (Human)
Description:P23458
Residue:1154
BDBM159763
NameBDBM159763
Synonyms:US10966980, Example 15 | US9035074, 15
TypeSmall organic molecule
Emp. Form.C17H24N6O2S
Mol. Mass.376.476
SMILESCN([C@@H]1C[C@@H](C1)NS(=O)(=O)C1CN(C1)C1CC1)c1ncnc2[nH]ccc12