Reaction Details
TargetNon-receptor tyrosine-protein kinase TYK2
LigandBDBM159749
Substrate/Competitorn/a
Meas. Tech.Enzyme Assay
pH7.4±n/a
Temperature298.15±n/a K
IC50 479±n/a nM
Commentsextracted
Citation Brown, MFFenwick, AEFlanagan, MEGonzales, AJohnson, TAKaila, NMitton-Fry, MJStrohbach, JWTenBrink, RETrzupek, JDUnwalla, RJVazquez, MLParikh, MD Pyrrolo[2,3-D]pyrimidine derivatives US Patent US9035074 Publication Date 5/19/2015
 
Non-receptor tyrosine-protein kinase TYK2
Name:Non-receptor tyrosine-protein kinase TYK2
Type:Protein
Mol. Mass.:133666.03
Organism:Homo sapiens (Human)
Description:P29597
Residue:1187
BDBM159749
NameBDBM159749
Synonyms:US10966980, Example 3 | US9035074, 3
TypeSmall organic molecule
Emp. Form.C15H23N5O2S
Mol. Mass.337.44
SMILESCC(C)CS(=O)(=O)N[C@H]1C[C@H](C1)N(C)c1ncnc2[nH]ccc12