Reaction Details
TargetP2X purinoceptor 7
LigandBDBM160075
Substrate/Competitorn/a
Meas. Tech.Radioligand Binding Assay
Ki 1.6±n/a nM
Citation Ameriks, MKRech, JCSavall, BM [1,2,4]triazolo[4,3-a]pyrazines as P2X7 modulators US Patent US9040534 Publication Date 5/26/2015
 
P2X purinoceptor 7
Name:P2X purinoceptor 7
Type:Protein
Mol. Mass.:68602.85
Organism:Homo sapiens (Human)
Description:Q99572
Residue:595
BDBM160075
NameBDBM160075
Synonyms:US10047092, 16 | US9040534, 16
TypeSmall organic molecule
Emp. Form.C18H14ClF3N6O
Mol. Mass.422.792
SMILESC[C@H]1Cn2c(nnc2-c2cnccn2)C(=O)N1Cc1cccc(c1Cl)C(F)(F)F