Reaction Details
TargetP2X purinoceptor 7
LigandBDBM160080
Substrate/Competitorn/a
Meas. Tech.Radioligand Binding Assay
Ki 3.5±n/a nM
Citation Ameriks, MKRech, JCSavall, BM [1,2,4]triazolo[4,3-a]pyrazines as P2X7 modulators US Patent US9040534 Publication Date 5/26/2015
 
P2X purinoceptor 7
Name:P2X purinoceptor 7
Type:Protein
Mol. Mass.:68403.50
Organism:Rattus norvegicus (Rat)
Description:Q64663
Residue:595
BDBM160080
NameBDBM160080
Synonyms:US10047092, 21 US9040534, 21
TypeSmall organic molecule
Emp. Form.C17H13ClF3N5O2
Mol. Mass.411.766
SMILESC[C@H]1Cn2c(nnc2C(=O)N1Cc1cccc(c1Cl)C(F)(F)F)-c1cocn1