Reaction Details
TargetP2X purinoceptor 7
LigandBDBM160089
Substrate/Competitorn/a
Meas. Tech.FLIPR Assay
pH7.4±n/a
IC50 0.9±n/a nM
Commentsextracted
Citation Ameriks, MKRech, JCSavall, BM [1,2,4]triazolo[4,3-a]pyrazines as P2X7 modulators US Patent US9040534 Publication Date 5/26/2015
 
P2X purinoceptor 7
Name:P2X purinoceptor 7
Type:Protein
Mol. Mass.:68602.85
Organism:Homo sapiens (Human)
Description:Q99572
Residue:595
BDBM160089
NameBDBM160089
Synonyms:US10047092, 30 US9040534, 30
TypeSmall organic molecule
Emp. Form.C19H14ClF4N5O
Mol. Mass.439.794
SMILESC[C@H]1Cn2c(nnc2-c2ccc(F)cn2)C(=O)N1Cc1cccc(c1Cl)C(F)(F)F