Reaction Details
TargetDNA topoisomerase 4 subunit A/B
LigandBDBM50393079
Substrate/Competitorn/a
Meas. Tech.ATPase Assay
Ki 12±0.0 nM
Citation Shannon, DLuisi, BKrawiec, MKuldipkumar, AK Solid forms of gyrase inhibitor (R)-1-ethyl-3-[6-fluoro-5-[2-(1-hydroxy-1-methyl-ethyl)pryimidin-5-yl]-7-(tetrahydrofuran-2-yl)-1H-benzimidazol-2-yl]urea US Patent US9040542 Publication Date 5/26/2015
 
DNA topoisomerase 4 subunit A/B
Name:DNA topoisomerase 4 subunit A/B
Synonyms:DNA topoisomerase 4
Type:Enzyme
Mol. Mass.:n/a
Description:n/a
Components:This complex has 2 components.
Component 1
Name:DNA topoisomerase 4 subunit A
Type:Enzyme
Mol. Mass.:90994.97
Organism:Staphylococcus aureus
Description:Q2FYS4
Residue:800
Component 2
Name:DNA topoisomerase 4 subunit B
Synonyms:DNA topoisomerase 4 subunit B PARE_STAA8 grlB | parE
Type:Enzyme
Mol. Mass.:74365.92
Organism:Staphylococcus aureus
Description:Q2FYS5
Residue:663
BDBM50393079
NameBDBM50393079
Synonyms:CHEMBL2152855 | US9040542, 23
TypeSmall organic molecule
Emp. Form.C21H25FN6O3
Mol. Mass.428.46
SMILESCCNC(=O)Nc1nc2cc(c(F)c([C@H]3CCCO3)c2[nH]1)-c1cnc(nc1)C(C)(C)O