Reaction Details
TargetEpidermal growth factor receptor
LigandBDBM50322823
Substrate/Competitorn/a
Meas. Tech.ssay of Inhibitory Activity on Wild Type EGFR and Mutant EGFR Kinase
Temperature298.15±n/a K
IC50 1.000±n/a nM
Commentsextracted
Citation Jin, YBu, PHe, QLan, JZhou, FZhang, LHe, X Azabicyclo derivatives, process for preparation thereof and medical use thereof US Patent US10085983 Publication Date 10/2/2018
 
Epidermal growth factor receptor
Name:Epidermal growth factor receptor
Type:Receptor Kinase Domain
Mol. Mass.:134279.59
Organism:Homo sapiens (Human)
Description:P00533
Residue:1210
BDBM50322823
NameBDBM50322823
Synonyms:(S)-N-(4-(3-chloro-4-fluorophenylamino)-7-(tetrahydrofuran-3-yloxy)quinazolin-6-yl)-4-(dimethylamino)but-2-enamide CHEMBL1173655 US10196365, Afatinib US9388170, Afatinib WO2022090481, Example afatinib
TypeSmall organic molecule
Emp. Form.C24H25ClFN5O3
Mol. Mass.485.938
SMILESCN(C)C\C=C\C(=O)Nc1cc2c(Nc3ccc(F)c(Cl)c3)ncnc2cc1O[C@H]1CCOC1