Reaction Details
TargetMelanocyte-stimulating hormone receptor
LigandBDBM160159
Substrate/Competitorn/a
Meas. Tech.Competitive Inhibition Assay
pH7.5±n/a
Temperature310.15±n/a K
Ki 0.2±n/a nM
Commentsextracted
Citation Dodd, JHShi, YYang, W Melanocortin receptor-specific peptides US Patent US9040663 Publication Date 5/26/2015
 
Melanocyte-stimulating hormone receptor
Name:Melanocyte-stimulating hormone receptor
Type:Enzyme
Mol. Mass.:34717.23
Organism:Homo sapiens (Human)
Description:Q01726
Residue:317
BDBM160159
NameBDBM160159
Synonyms:US9040663, 5
TypeSmall organic molecule
Emp. Form.C48H69Cl2N17O9
Mol. Mass.1099.076
SMILESCC(=O)N[C@@H](CCCNC(N)=N)C(=O)N[C@H]1CCC(=O)NCCC[C@H](NC(=O)[C@H](Cc2c[nH]c3ccccc23)NC(=O)[C@H](CCCNC(N)=N)NC(=O)[C@@H](Cc2ccc(Cl)c(Cl)c2)NC(=O)[C@H](CCN)NC1=O)C(N)=O