Reaction Details
TargetActivin receptor type-1
LigandBDBM36356
Substrate/Competitorn/a
Meas. Tech.Kinase Assay
IC50 26.68±n/a nM
Citation Hong, CCHopkins, CRHatzopoulos, AKLindsley, CWHao, J Compounds and methods useful for directing stem cell differentiation US Patent US9040694 Publication Date 5/26/2015
 
Activin receptor type-1
Name:Activin receptor type-1
Type:n/a
Mol. Mass.:57158.32
Organism:Homo sapiens (Human)
Description:n/a
Residue:509
BDBM36356
NameBDBM36356
Synonyms:DMH3 US9040694, 3
TypeSmall organic molecule
Emp. Form.C26H25N5O
Mol. Mass.423.5096
SMILESCN(C)CCCOc1ccc(cc1)-c1cnc2c(cnn2c1)-c1ccnc2ccccc12