Reaction Details
TargetD(1A) dopamine receptor
LigandBDBM160876
Substrate/Competitorn/a
Meas. Tech.Competition Binding Assay
Ki 7.66±n/a nM
Citation Brodney, MADavoren, JEDounay, ABEfremov, IVGray, DLGreen, MEHenderson, JLLee, CMente, SRO'Neil, SVRogers, BNZhang, L Heteroaromatic compounds and their use as dopamine D1 ligands US Patent US9107923 Publication Date 8/18/2015
 
D(1A) dopamine receptor
Name:D(1A) dopamine receptor
Type:Enzyme
Mol. Mass.:49303.43
Organism:Homo sapiens (Human)
Description:P21728
Residue:446
BDBM160876
NameBDBM160876
Synonyms:US10093655, Example 46 US9107923, 46
TypeSmall organic molecule
Emp. Form.C21H21N3O2
Mol. Mass.347.4103
SMILESCc1cc(Oc2ncccc2C2CC2)ccc1-c1c(C)n[nH]c(=O)c1C