Reaction Details
TargetBifunctional ligase/repressor BirA
LigandBDBM161468
Substrate/Competitorn/a
Meas. Tech.Enzyme Inhibition Assay
pH8±n/a
Temperature310.15±n/a K
Ki>30000±n/a nM
Commentsextracted
Citation Abell, APolyak, SBooker, GWallace, JSoares da Costa, TJarrad, ATieu, WKeeling, KLPedersen, DSPendini, NWilce, MYap, MY Antimicrobial compounds US Patent US9108978 Publication Date 8/18/2015
 
Bifunctional ligase/repressor BirA
Name:Bifunctional ligase/repressor BirA
Type:Repressor protein
Mol. Mass.:35313.58
Organism:Escherichia coli
Description:n/a
Residue:321
BDBM161468
NameBDBM161468
Synonyms:US9108978, 6.09
TypeSmall organic molecule
Emp. Form.C24H32N6O3S
Mol. Mass.484.614
SMILESCc1ccc2oc(=O)n(CCCCn3cc(CCCCC[C@@H]4SC[C@@H]5NC(=O)N[C@H]45)nn3)c2c1